{"text_format":"2","workbook":"xlsx","n_sheets":14,"sheets":["List of Templates","Car Logbook","Working From Home","Travel Diary","Rental Property","List (3)","Business","Work Related Expenses","List5","Actual Car Expenses","List5 (2)","List (4)","List (2)","List"],"not_rendered":{"charts":0,"images":1,"macros":0,"external_links":0,"defined_names":7,"comments":7,"pivot_tables":0},"unopened":[],"bounds":{"document_bytes":16777216,"sheet_cells":100000,"run_cost":"one","rows_first":2000,"rows_last":500,"rows_between":2000,"halvings":0,"cell_chars":16384,"cell_head_chars":4096},"cells_cut":0,"cells_raw":0,"read":"whole","date_system":"1900"}

{"sheet":"List of Templates","index":0,"n_rows":10,"n_cols":2,"rows_kept":10,"cut":false,"hidden":false,"merged":[]}
[]
[null,"Click on the name of the template to jump to the template"]
[]
[null,"Car Logbook"]
[null,"Working From Home"]
[null,"Tavel Diary"]
[null,"Rental Property"]
[null,"Business"]
[null,"Work Related Expenses"]
[null,"Actual Car Expenses"]

{"sheet":"Car Logbook","index":1,"n_rows":1007,"n_cols":10,"rows_kept":1007,"cut":false,"hidden":false,"merged":[[0,0,0,9],[4,0,4,9],[3,0,3,9],[5,8,5,9],[14,0,14,1],[14,2,14,3],[14,5,15,5],[14,6,15,6],[14,8,15,8],[14,9,15,9],[14,7,15,7],[9,0,9,1],[5,0,5,1]]}
[]
[{"$nulls":5},"13-000-RBIZZ"]
[{"$nulls":5},"team@rbizz.com.au"]
["WORK / BUSINESS / PERSONAL CAR LOG BOOK"]
["IMPORTANT : You must maintain logbook for a continuous period of 12 weeks in a financial year."]
["Click to jump to list of templates",{"$nulls":7},"SUMMARY"]
[{"$nulls":8},"Total travel",{"$f":"SUM(I17:I2005)+SUM(J17:J2005)+SUM(H17:H2005)","v":0}]
[{"$nulls":5},"VEHICLE DETAILS",null,null,"Work-related travel",{"$f":"SUM(H17:H2005)","v":0}]
[{"$nulls":4},"Make",null,null,null,"Business-related travel",{"$f":"SUM(I17:I2005)","v":0}]
["ODOMETER READING",null,null,null,"Model",null,null,null,"Personal travel",{"$f":"SUM(J17:J2005)","v":0}]
["Financial year",null,null,null,"Year",null,null,null,"Work-related %",{"$f":"J8/J7","v":{"$error":"#DIV/0!"}}]
["As at 1st of July",null,null,null,"Registration",null,null,null,"Business-related %",{"$f":"+J9/J7","v":{"$error":"#DIV/0!"}}]
["As at 30th of June",null,null,null,"Engine size",null,null,null,"Personal %",{"$f":"J10/J7","v":{"$error":"#DIV/0!"}}]
[]
["Date of Trip (DD/MM/YY)",null,"Odometer Reading",null,null,"Purpose of Trip","Work / Business / Personal","Work-related travel (KM)","Business-related travel (KM)","Personal travel (KM)"]
["Start","End","Start","End","Check"]
[{"$nulls":4},{"$f":"IF(D17<C17,\"Check End\",\"\")","v":""},null,null,{"$f":"IF(G17=\"Work\",(D17-C17),0)","v":0},{"$f":"IF(G17=\"Business\",(D17-C17),0)","v":0},{"$f":"IF(G17=\"Personal\",(D17-C17),0)","v":0}]
[{"$nulls":4},"",null,null,{"$f":"IF(G18=\"Work\",(D18-C18),0)","v":0},{"$f":"IF(G18=\"Business\",(D18-C18),0)","v":0},{"$f":"IF(G18=\"Personal\",(D18-C18),0)","v":0}]
[{"$nulls":4},"",null,null,0,0,0]
[{"$nulls":4},"",null,null,0,0,0]
[{"$nulls":4},"",null,null,0,0,0]
[{"$nulls":4},"",null,null,0,0,0]
[{"$nulls":4},"",null,null,0,0,0]
[{"$nulls":4},"",null,null,0,0,0]
[{"$nulls":4},"",null,null,0,0,0]
[{"$nulls":4},"",null,null,0,0,0]
[{"$nulls":4},"",null,null,0,0,0]
[{"$nulls":4},"",null,null,0,0,0]
[{"$nulls":4},"",null,null,0,0,0]
[{"$nulls":4},"",null,null,0,0,0]
[{"$nulls":4},"",null,null,0,0,0]
[{"$nulls":4},"",null,null,0,0,0]
[{"$nulls":4},"",null,null,0,0,0]
[{"$nulls":4},"",null,null,0,0,0]
[{"$nulls":4},"",null,null,0,0,0]
[{"$nulls":4},"",null,null,0,0,0]
[{"$nulls":4},"",null,null,0,0,0]
[{"$nulls":4},"",null,null,0,0,0]
[{"$nulls":4},"",null,null,0,0,0]
[{"$nulls":4},"",null,null,0,0,0]
{"$rows_left_out":968}
{"sheet":"Working From Home","index":2,"n_rows":1007,"n_cols":14,"rows_kept":1007,"cut":false,"hidden":false,"merged":[[7,2,7,3],[14,11,15,11],[14,12,15,12],[14,13,15,13],[5,0,5,1],[0,0,0,13],[8,2,8,3],[13,2,13,7],[14,2,14,3],[14,5,14,6],[14,9,15,9],[14,10,15,10],[1,0,1,13],[2,0,2,13],[3,0,3,13],[4,0,4,13],[5,12,5,13]]}
[]
["13-000-RBIZZ"]
["team@rbizz.com.au"]
["WORKING FROM HOME TIMESHEETS"]
["IMPORTANT : If you are entering time, please do not enter hours in column I. If you are entering hours, please do not enter time. Please use end date if you are entering hours for a period (for example weekly/fortnighly)"]
["Click to jump to list of templates",{"$nulls":11},"SUMMARY"]
[{"$nulls":12},"Total Hours",{"$f":"SUM(M17:M2005)+SUM(N17:N2005)+SUM(L17:L2005)","v":0}]
[null,"03:00:00","Type as 3:00 (space) am or 3:00",{"$nulls":9},"Work Hours",{"$f":"SUM(L17:L2005)","v":0}]
[null,"15:00:00","Type as 3:00 (space) pm or 15:00",{"$nulls":5},"Name",null,null,null,"Business Hours",{"$f":"SUM(M17:M2005)","v":0}]
[null,"Check Finish","It means your finish time lower than start time",{"$nulls":5},"Year",null,null,null,"Personal Hours",{"$f":"SUM(N17:N2005)","v":0}]
[{"$nulls":12},"Work-related %",{"$f":"N8/N7","v":{"$error":"#DIV/0!"}}]
[{"$nulls":12},"Business-related %",{"$f":"+N9/N7","v":{"$error":"#DIV/0!"}}]
[{"$nulls":12},"Personal %",{"$f":"N10/N7","v":{"$error":"#DIV/0!"}}]
[null,null,"<-------------------------------------------TIME (IF ENTERING DAILY)------------------------------------------------->",{"$nulls":5},"HOURS (IF WEEKLY)"]
[null,null,"Before Lunch",null,null,"After Lunch",null,null,"TOTAL","Work description","Work / Business / Personal","Work Hours","Business Hours","Personal Hours"]
["Start Date","End Date","Start Time","Finish Time","Check","Start Time","Finish Time","Check","HOURS"]
[{"$nulls":4},{"$f":"IF(D17<C17,\"Check Finish\",\"\")","v":""},null,null,{"$f":"IF(G17<F17,\"Check Finish\",\"\")","v":""},null,null,null,{"$f":"IF(K17=\"Work\",((G17-F17)*24+(D17-C17)*24+I17),0)","v":0},{"$f":"IF(K17=\"Business\",((G17-F17)*24+(D17-C17)*24+I17),0)","v":0},{"$f":"IF(K17=\"Personal\",((G17-F17)*24+(D17-C17)*24+I17),0)","v":0}]
[{"$nulls":4},{"$f":"IF(D18<C18,\"Check Finish\",\"\")","v":""},null,null,{"$f":"IF(G18<F18,\"Check Finish\",\"\")","v":""},null,null,null,{"$f":"IF(K18=\"Work\",((G18-F18)*24+(D18-C18)*24+I18),0)","v":0},{"$f":"IF(K18=\"Business\",((G18-F18)*24+(D18-C18)*24+I18),0)","v":0},{"$f":"IF(K18=\"Personal\",((G18-F18)*24+(D18-C18)*24+I18),0)","v":0}]
[{"$nulls":4},"",null,null,"",null,null,null,0,0,0]
[{"$nulls":4},"",null,null,"",null,null,null,0,0,0]
[{"$nulls":4},"",null,null,"",null,null,null,0,0,0]
[{"$nulls":4},"",null,null,"",null,null,null,0,0,0]
[{"$nulls":4},"",null,null,"",null,null,null,0,0,0]
[{"$nulls":4},"",null,null,"",null,null,null,0,0,0]
[{"$nulls":4},"",null,null,"",null,null,null,0,0,0]
[{"$nulls":4},"",null,null,"",null,null,null,0,0,0]
[{"$nulls":4},"",null,null,"",null,null,null,0,0,0]
[{"$nulls":4},"",null,null,"",null,null,null,0,0,0]
[{"$nulls":4},"",null,null,"",null,null,null,0,0,0]
[{"$nulls":4},"",null,null,"",null,null,null,0,0,0]
[{"$nulls":4},"",null,null,"",null,null,null,0,0,0]
[{"$nulls":4},"",null,null,"",null,null,null,0,0,0]
[{"$nulls":4},"",null,null,"",null,null,null,0,0,0]
[{"$nulls":4},"",null,null,"",null,null,null,0,0,0]
[{"$nulls":4},"",null,null,"",null,null,null,0,0,0]
[{"$nulls":4},"",null,null,"",null,null,null,0,0,0]
[{"$nulls":4},"",null,null,"",null,null,null,0,0,0]
[{"$nulls":4},"",null,null,"",null,null,null,0,0,0]
[{"$nulls":4},"",null,null,"",null,null,null,0,0,0]
[{"$nulls":4},"",null,null,"",null,null,null,0,0,0]
{"$rows_left_out":968}
{"sheet":"Travel Diary","index":3,"n_rows":403,"n_cols":7,"rows_kept":403,"cut":false,"hidden":false,"merged":[[0,0,0,6],[1,0,1,6],[2,0,2,6],[3,0,3,6],[4,0,4,6],[7,4,7,6],[8,4,8,6],[9,4,9,6],[16,0,16,6],[5,0,5,1],[6,4,6,6]]}
[]
["13-000-RBIZZ"]
["team@rbizz.com.au"]
["TRAVEL DIARY"]
["IMPORTANT : One sheet is for one trip, please copy and create a new sheet for new trip."]
["Click to jump to list of templates"]
["03:00:00","Type as 3:00 (space) am or 3:00",null,"Name"]
["15:00:00","Type as 3:00 (space) pm or 15:00",null,"Trip Start Date"]
[null,null,null,"Trip End Date"]
[null,null,null,"Reason For Trip"]
[]
[null,null,null,"Number of days spent in transit / unavoidable delays",null,{"$f":"IFERROR(E12/$E$15,\"\")","v":""}]
[null,null,null,"Number of days where business activi ties undertaken",null,{"$f":"IFERROR(E13/$E$15,\"\")","v":""}]
[null,null,null,"Number of days – Private Component",null,{"$f":"IFERROR(E14/$E$15,\"\")","v":""}]
[null,null,null,"Total number of days away",{"$f":"SUM(E12:E14)","v":0},{"$f":"SUM(F12:F14)","v":0}]
[]
["Business Record Keeping"]
["Date","Start Time","End Time","Description of work / business activity","Location of activity","Duration (Hours)","Notes"]
[{"$nulls":5},{"$f":"(C19-B19)*24","v":0}]
[{"$nulls":5},{"$f":"(C20-B20)*24","v":0}]
[{"$nulls":5},0]
[{"$nulls":5},0]
[{"$nulls":5},0]
[{"$nulls":5},0]
[{"$nulls":5},0]
[{"$nulls":5},0]
[{"$nulls":5},0]
[{"$nulls":5},0]
[{"$nulls":5},0]
[{"$nulls":5},0]
[{"$nulls":5},0]
[{"$nulls":5},0]
[{"$nulls":5},0]
[{"$nulls":5},0]
[{"$nulls":5},0]
[{"$nulls":5},0]
[{"$nulls":5},0]
[{"$nulls":5},0]
[{"$nulls":5},0]
[{"$nulls":5},0]
{"$rows_left_out":364}
{"sheet":"Rental Property","index":4,"n_rows":45,"n_cols":8,"rows_kept":45,"cut":false,"hidden":false,"merged":[[6,2,6,4],[7,2,7,4],[5,0,5,1],[0,0,0,7],[1,0,1,7],[2,0,2,7],[3,0,3,7],[8,2,8,4],[9,2,9,4],[10,2,10,4],[12,0,12,4],[12,6,12,7]]}
[]
["13-000-RBIZZ"]
["team@rbizz.com.au"]
["RENTAL RECORD KEEPING"]
[null,null,null,"IMPORTANT - Please ensure all transactions fall within the first and last date of the financial year."]
["Click to jump to list of templates"]
[null,"Property Address"]
[null,"Date property first available for rent:"]
[null,"Number of weeks available for rent in the year:"]
[null,"Your ownership percentage:"]
[null,"Financial Year"]
[]
["Rental Record Keeping",{"$nulls":5},"Rental Summary"]
["Date","Description","Type","Amount","Notes",null,null,"Amount"]
[{"$nulls":6},"INCOME:"]
[{"$nulls":6},"Rental Income",{"$f":"SUMIF($C$15:$C$507,G16,$D$15:$D$507)","v":0}]
[{"$nulls":6},"Other rental related income",{"$f":"SUMIF($C$15:$C$507,G17,$D$15:$D$507)","v":0}]
[{"$nulls":6},"Total Rental Income",{"$f":"SUM(H16:H17)","v":0}]
[{"$nulls":6},"EXPENSE:"]
[{"$nulls":6},"Advertising for tenants",{"$f":"SUMIF($C$15:$C$507,G20,$D$15:$D$507)","v":0}]
[{"$nulls":6},"Body corporate",0]
[{"$nulls":6},"Borrowing expenses",0]
[{"$nulls":6},"Cleaning",0]
[{"$nulls":6},"Council rates",0]
[{"$nulls":6},"Capital allowances",0]
[{"$nulls":6},"Gardening/lawn mowing",0]
[{"$nulls":6},"Insurance",0]
[{"$nulls":6},"Interest on loans",0]
[{"$nulls":6},"Land tax",0]
[{"$nulls":6},"Legal fees",0]
[{"$nulls":6},"Pest control",0]
[{"$nulls":6},"Property agent fees/commission",0]
[{"$nulls":6},"Repairs and maintenance",0]
[{"$nulls":6},"Capital works deductions",0]
[{"$nulls":6},"Stationery, telephone and postage",0]
[{"$nulls":6},"Travel expenses",0]
[{"$nulls":6},"Water charges",0]
[{"$nulls":6},"Sundry rental expenses",0]
[{"$nulls":6},"Total Rental Expenses",{"$f":"SUM(H20:H38)","v":0}]
[]
{"$rows_left_out":6}
{"sheet":"List (3)","index":5,"n_rows":23,"n_cols":1,"rows_kept":23,"cut":false,"hidden":true,"merged":[]}
["Rental Income"]
["Other rental related income"]
["Advertising for tenants"]
["Body corporate"]
["Borrowing expenses"]
["Cleaning"]
["Council rates"]
["Capital allowances"]
["Gardening/lawn mowing"]
["Insurance"]
["Interest on loans"]
["Land tax"]
["Legal fees"]
["Pest control"]
["Property agent fees/commission"]
["Repairs and maintenance"]
["Capital works deductions"]
["Stationery, telephone and postage"]
["Travel expenses"]
["Water charges"]
["Sundry rental expenses"]
["New asset purchased"]
["Other expenses"]

{"sheet":"Business","index":6,"n_rows":38,"n_cols":8,"rows_kept":38,"cut":false,"hidden":false,"merged":[[6,2,6,4],[7,2,7,4],[5,0,5,1],[0,0,0,7],[1,0,1,7],[2,0,2,7],[3,0,3,7],[8,2,8,4],[9,2,9,4],[10,2,10,4],[12,0,12,4],[12,6,12,7]]}
[]
["13-000-RBIZZ"]
["team@rbizz.com.au"]
["BUSINESS RECORD KEEPING"]
[null,null,null,"IMPORTANT - Please ensure all transactions fall within the first and last date of the financial year."]
["Click to jump to list of templates"]
[null,"Business name:"]
[null,"Business ABN:"]
[null,"Commencement date:"]
[null,"Business activity:"]
[null,"Business address:"]
[]
["Business Record Keeping",{"$nulls":5},"Business Summary"]
["Date","Description","Type","Amount","Notes",null,null,"Amount"]
[{"$nulls":6},"INCOME:"]
[{"$nulls":6},"Business Income",{"$f":"SUMIF($C$15:$C$507,G16,$D$15:$D$507)","v":0}]
[{"$nulls":6},"Total Business Income",{"$f":"SUM(H16)","v":0}]
[{"$nulls":6},"EXPENSE:"]
[{"$nulls":6},"Stock/goods purchases",{"$f":"SUMIF($C$15:$C$507,G19,$D$15:$D$507)","v":0}]
[{"$nulls":6},"Asset/equipment purchase",0]
[{"$nulls":6},"Contractor, sub-contractor and commission expenses",0]
[{"$nulls":6},"Superannuation expenses",0]
[{"$nulls":6},"Rent expenses",0]
[{"$nulls":6},"Interest expenses",0]
[{"$nulls":6},"Motor vehicle expenses",0]
[{"$nulls":6},"Repair and maintenance",0]
[{"$nulls":6},"Home office expenses",0]
[{"$nulls":6},"Internet expenses",0]
[{"$nulls":6},"Mobile phone expenses",0]
[{"$nulls":6},"Insurance expenses",0]
[{"$nulls":6},"Travel expenses",0]
[{"$nulls":6},"Advertising/marketing expenses",0]
[{"$nulls":6},"Delivery/freight expenses",0]
[{"$nulls":6},"Self education expenses",0]
[{"$nulls":6},"Other expenses",0]
[{"$nulls":6},"Total Business Expenses",{"$f":"SUM(H19:H35)","v":0}]
[]
[{"$nulls":6},"Net Profit/Loss",{"$f":"+H17-H36","v":0}]

{"sheet":"Work Related Expenses","index":7,"n_rows":75,"n_cols":8,"rows_kept":75,"cut":false,"hidden":false,"merged":[[0,0,0,7],[1,0,1,7],[2,0,2,7],[3,0,3,7],[6,2,6,4],[7,2,7,4],[9,0,9,4],[9,6,9,7],[4,0,4,7],[7,6,7,7],[5,0,5,1]]}
[]
["13-000-RBIZZ"]
["team@rbizz.com.au"]
["OTHER DEDUCTIONS / EXPENSES"]
["IMPORTANT : Please select a category to each expense in column C. For the list of category please refer column G. Please scroll the dropdown list to select the right category."]
["Click to jump to list of templates",{"$nulls":6},{"$f":"SUM(D12:D499)","v":0}]
[null,"Name",{"$nulls":5},{"$f":"SUM(H13:H15,H17:H20,H22:H31,H33:H34,H36,H38:H46,H48:H50,H52:H75)","v":0}]
[null,"Financial Year",{"$nulls":4},{"$f":"IF(H6=H7,\"\",\"You have missed selecting category in column C\")","v":""}]
[]
["Other Expenses Details",{"$nulls":5},"Other Expenses Summary"]
["Date","Description","Select Expense Category - Ref Colm G","Amount","Notes",null,null,"Amount"]
[{"$nulls":6},"EXPENSE:"]
[{"$nulls":6},"Travel - Fare",{"$f":"SUMIF($C$12:$C$506,G13,$D$12:$D$506)","v":0}]
[{"$nulls":6},"Travel - Meal",{"$f":"SUMIF($C$12:$C$506,G14,$D$12:$D$506)","v":0}]
[{"$nulls":6},"Travel - Others",{"$f":"SUMIF($C$12:$C$506,G15,$D$12:$D$506)","v":0}]
[{"$nulls":6},"Toal Travel Expenses",{"$f":"SUM(H13:H15)","v":0}]
[{"$nulls":6},"Uniform - Occupation Specific",{"$f":"SUMIF($C$12:$C$506,G17,$D$12:$D$506)","v":0}]
[{"$nulls":6},"Uniform - Protective",{"$f":"SUMIF($C$12:$C$506,G18,$D$12:$D$506)","v":0}]
[{"$nulls":6},"Uniform - Compulsory",{"$f":"SUMIF($C$12:$C$506,G19,$D$12:$D$506)","v":0}]
[{"$nulls":6},"Uniform - Non-compulsory",{"$f":"SUMIF($C$12:$C$506,G20,$D$12:$D$506)","v":0}]
[{"$nulls":6},"Toal Uniform Expenses",{"$f":"SUM(H17:H20)","v":0}]
[{"$nulls":6},"Self Education - Laptop",{"$f":"SUMIF($C$12:$C$506,G22,$D$12:$D$506)","v":0}]
[{"$nulls":6},"Self Education - Desktop",0]
[{"$nulls":6},"Self Education - Tablet",0]
[{"$nulls":6},"Self Education - Phone",0]
[{"$nulls":6},"Self Education - Educaiton Fee",0]
[{"$nulls":6},"Self Education - Study Material",0]
[{"$nulls":6},"Self Education - Repairs",{"$f":"SUMIF($C$12:$C$506,G28,$D$12:$D$506)","v":0}]
[{"$nulls":6},"Self Education - Car Expenses",0]
[{"$nulls":6},"Self Education - Parking & Tolls",0]
[{"$nulls":6},"Self Education - Others",0]
[{"$nulls":6},"Toal Self Education Expenses",{"$f":"SUM(H22:H31)","v":0}]
[{"$nulls":6},"Tools - Up to $300 each",{"$f":"SUMIF($C$12:$C$506,G33,$D$12:$D$506)","v":0}]
[{"$nulls":6},"Tools - More than $300 each",0]
[{"$nulls":6},"Toal Tools Expenses",{"$f":"SUM(H33:H34)","v":0}]
[{"$nulls":6},"Gifts and donations",0]
[]
[{"$nulls":6},"Mobile phone usage",0]
[{"$nulls":6},"Landline usage",0]
[{"$nulls":6},"Internet usage",0]
{"$rows_left_out":36}
{"sheet":"List5","index":8,"n_rows":56,"n_cols":1,"rows_kept":56,"cut":false,"hidden":true,"merged":[]}
[{"$f":"+'Work Related Expenses'!G13","v":"Travel - Fare"}]
[{"$f":"+'Work Related Expenses'!G14","v":"Travel - Meal"}]
[{"$f":"+'Work Related Expenses'!G15","v":"Travel - Others"}]
[{"$f":"+'Work Related Expenses'!G17","v":"Uniform - Occupation Specific"}]
[{"$f":"+'Work Related Expenses'!G18","v":"Uniform - Protective"}]
[{"$f":"+'Work Related Expenses'!G19","v":"Uniform - Compulsory"}]
[{"$f":"+'Work Related Expenses'!G20","v":"Uniform - Non-compulsory"}]
[{"$f":"+'Work Related Expenses'!G22","v":"Self Education - Laptop"}]
[{"$f":"+'Work Related Expenses'!G23","v":"Self Education - Desktop"}]
[{"$f":"+'Work Related Expenses'!G24","v":"Self Education - Tablet"}]
[{"$f":"+'Work Related Expenses'!G25","v":"Self Education - Phone"}]
[{"$f":"+'Work Related Expenses'!G26","v":"Self Education - Educaiton Fee"}]
[{"$f":"+'Work Related Expenses'!G27","v":"Self Education - Study Material"}]
[{"$f":"+'Work Related Expenses'!G28","v":"Self Education - Repairs"}]
[{"$f":"+'Work Related Expenses'!G29","v":"Self Education - Car Expenses"}]
[{"$f":"+'Work Related Expenses'!G30","v":"Self Education - Parking & Tolls"}]
[{"$f":"+'Work Related Expenses'!G31","v":"Self Education - Others"}]
[{"$f":"+'Work Related Expenses'!G33","v":"Tools - Up to $300 each"}]
[{"$f":"+'Work Related Expenses'!G34","v":"Tools - More than $300 each"}]
[{"$f":"+'Work Related Expenses'!G36","v":"Gifts and donations"}]
[{"$f":"+'Work Related Expenses'!G38","v":"Mobile phone usage"}]
[{"$f":"+'Work Related Expenses'!G39","v":"Landline usage"}]
[{"$f":"+'Work Related Expenses'!G40","v":"Internet usage"}]
[{"$f":"+'Work Related Expenses'!G41","v":"Mobile phone device"}]
[{"$f":"+'Work Related Expenses'!G42","v":"Landline device"}]
[{"$f":"+'Work Related Expenses'!G43","v":"Internet device"}]
[{"$f":"+'Work Related Expenses'!G44","v":"Computer device"}]
[{"$f":"+'Work Related Expenses'!G45","v":"Computer consumables"}]
[{"$f":"+'Work Related Expenses'!G46","v":"Repairs and maintenance"}]
[{"$f":"+'Work Related Expenses'!G48","v":"Tax Affairs - Interest by ATO"}]
[{"$f":"+'Work Related Expenses'!G49","v":"Tax Affairs - Litigation"}]
[{"$f":"+'Work Related Expenses'!G50","v":"Tax Affairs - Tax Agent Fee"}]
[{"$f":"+'Work Related Expenses'!G52","v":"Sun protection"}]
[{"$f":"+'Work Related Expenses'!G53","v":"Union fee"}]
[{"$f":"+'Work Related Expenses'!G54","v":"Personal super contribution"}]
[{"$f":"+'Work Related Expenses'!G55","v":"Project pool"}]
[{"$f":"+'Work Related Expenses'!G56","v":"Insurance - income protection/illness/sickness"}]
[{"$f":"+'Work Related Expenses'!G57","v":"Foreign exchange loss"}]
[{"$f":"+'Work Related Expenses'!G58","v":"Membership Fee - professional / trade"}]
[{"$f":"IF('Work Related Expenses'!G59=\"write name of deduction if needed\",\"\",'Work Related Expenses'!G59)","v":""}]
{"$rows_left_out":17}
{"sheet":"Actual Car Expenses","index":9,"n_rows":21,"n_cols":8,"rows_kept":21,"cut":false,"hidden":false,"merged":[[6,2,6,4],[7,2,7,4],[7,6,7,7],[9,0,9,4],[9,6,9,7],[0,0,0,7],[1,0,1,7],[2,0,2,7],[3,0,3,7],[4,0,4,7],[5,0,5,1]]}
[]
["13-000-RBIZZ"]
["team@rbizz.com.au"]
["ACTUAL CAR EXPENSES"]
["IMPORTANT : Please select a category to each expense in column C. For the list of category please refer column G. Please scroll the dropdown list to select the right category."]
["Click to jump to list of templates",{"$nulls":6},{"$f":"SUM(D12:D499)","v":0}]
[null,"Name",{"$nulls":5},{"$f":"SUM(H13:H15,H17:H20,H22:H31,H33:H34,H36,H38:H46,H48:H50,H52:H75)","v":0}]
[null,"Financial Year",{"$nulls":4},{"$f":"IF(H6=H7,\"\",\"You have missed selecting category in column C\")","v":""}]
[]
["Actual Car Expenses Details",{"$nulls":5},"Actual Car Expenses Summary"]
["Date","Description","Select Expense Category - Ref Colm G","Amount","Notes",null,null,"Amount"]
[{"$nulls":6},"EXPENSE:"]
[{"$nulls":6},"Car - Fuel and oil",{"$f":"SUMIF($C$12:$C$506,G13,$D$12:$D$506)","v":0}]
[{"$nulls":6},"Car - Registration",{"$f":"SUMIF($C$12:$C$506,G14,$D$12:$D$506)","v":0}]
[{"$nulls":6},"Car - Insurance",{"$f":"SUMIF($C$12:$C$506,G15,$D$12:$D$506)","v":0}]
[{"$nulls":6},"Car - Repairs and maintenance",{"$f":"SUMIF($C$12:$C$506,G16,$D$12:$D$506)","v":0}]
[{"$nulls":6},"Car - Other Expenses",{"$f":"SUMIF($C$12:$C$506,G17,$D$12:$D$506)","v":0}]
[{"$nulls":6},"Car - Interest paid",{"$f":"SUMIF($C$12:$C$506,G18,$D$12:$D$506)","v":0}]
[{"$nulls":6},"Car - Finance leasing charges",{"$f":"SUMIF($C$12:$C$506,G19,$D$12:$D$506)","v":0}]
[{"$nulls":6},"Car - Depreciation",{"$f":"SUMIF($C$12:$C$506,G20,$D$12:$D$506)","v":0}]
[{"$nulls":6},"Toal Actual Car Expenses",{"$f":"SUM(H13:H20)","v":0}]

{"sheet":"List5 (2)","index":10,"n_rows":7,"n_cols":1,"rows_kept":7,"cut":false,"hidden":true,"merged":[]}
[{"$f":"+'Actual Car Expenses'!G13","v":"Car - Fuel and oil"}]
[{"$f":"+'Actual Car Expenses'!G14","v":"Car - Registration"}]
[{"$f":"+'Actual Car Expenses'!G15","v":"Car - Insurance"}]
[{"$f":"+'Actual Car Expenses'!G17","v":"Car - Other Expenses"}]
[{"$f":"+'Actual Car Expenses'!G18","v":"Car - Interest paid"}]
[{"$f":"+'Actual Car Expenses'!G19","v":"Car - Finance leasing charges"}]
[{"$f":"+'Actual Car Expenses'!G20","v":"Car - Depreciation"}]

{"sheet":"List (4)","index":11,"n_rows":18,"n_cols":1,"rows_kept":18,"cut":false,"hidden":true,"merged":[]}
["Business Income"]
["Stock/goods purchases"]
["Asset/equipment purchase"]
["Contractor, sub-contractor and commission expenses"]
["Superannuation expenses"]
["Rent expenses"]
["Interest expenses"]
["Motor vehicle expenses"]
["Repair and maintenance"]
["Home office expenses"]
["Internet expenses"]
["Mobile phone expenses"]
["Insurance expenses"]
["Travel expenses"]
["Advertising/marketing expenses"]
["Delivery/freight expenses"]
["Self education expenses"]
["Other expenses"]

{"sheet":"List (2)","index":12,"n_rows":3,"n_cols":1,"rows_kept":3,"cut":false,"hidden":true,"merged":[]}
["Work"]
["Personal"]
["Business"]

{"sheet":"List","index":13,"n_rows":3,"n_cols":1,"rows_kept":3,"cut":false,"hidden":true,"merged":[]}
["Work"]
["Personal"]
["Business"]